BDBM50282260 7-Butyl-8-[2'-(2H-tetrazol-5-yl)-biphenyl-4-ylmethyl]-6,8-diaza-spiro[4.5]dec-6-en-9-one::CHEMBL42200
SMILES CCCCC1=NC2(CCCC2)CC(=O)N1Cc1ccc(cc1)-c1ccccc1-c1nnn[nH]1
InChI Key InChIKey=QQXUWSWJFJDVQE-UHFFFAOYSA-N
Data  1 IC50
  Tab Delimited (TSV)   2D SDfile   Computed 3D by Vconf -m prep SDfile
Find this compound or compounds like it in BindingDB:
Activity Spreadsheet -- Enzyme Inhibition Constant Data from BindingDB
Found 1 hit for monomerid = 50282260
LigandPNGBDBM50282260(7-Butyl-8-[2'-(2H-tetrazol-5-yl)-biphenyl-4-ylmeth...)
Affinity DataIC50:  1nM. Assay description: In vitro inhibition of specific binding of [125I]-AII to Angiotensin II receptor, type 1 from rat liver membrane
In DepthDetails Article