BDBM50285171 2-{2,6-Dioxo-4-propyl-3-[2'-(1H-tetrazol-5-yl)-biphenyl-4-ylmethyl]-3,6-dihydro-2H-pyrimidin-1-yl}-N,N-dimethyl-acetamide::CHEMBL62269
SMILES CCCc1cc(=O)n(CC(=O)N(C)C)c(=O)n1Cc1ccc(cc1)-c1ccccc1-c1nnn[nH]1
InChI Key InChIKey=CBTOFFZALGYFNR-UHFFFAOYSA-N
Data  2 IC50
  Tab Delimited (TSV)   2D SDfile   Computed 3D by Vconf -m prep SDfile
Find this compound or compounds like it in BindingDB:
Activity Spreadsheet -- Enzyme Inhibition Constant Data from BindingDB
Found 2 hits for monomerid = 50285171
TargetType-1 angiotensin II receptor(Bos taurus)
TBA
Curated by ChEMBL
LigandPNGBDBM50285171(2-{2,6-Dioxo-4-propyl-3-[2'-(1H-tetrazol-5-yl)-bip...)
Affinity DataIC50:  9.30nM. Assay description: Tested for binding affinity against angiotensin II receptor in bovine adrenal cortex
In DepthDetails Article
LigandPNGBDBM50285171(2-{2,6-Dioxo-4-propyl-3-[2'-(1H-tetrazol-5-yl)-bip...)
Affinity DataIC50:  0.650nM. Assay description: Tested for binding affinity against angiotensin II receptor in rat adrenal cortex
In DepthDetails Article