BDBM50285344 CHEMBL40585::[4-(7-Methyl-2-propyl-imidazo[4,5-b]pyridin-3-ylmethyl)-phenoxy]-o-tolyl-acetic acid
SMILES CCCc1nc2c(C)ccnc2n1Cc1ccc(OC(C(O)=O)c2ccccc2C)cc1
InChI Key InChIKey=XXHLCVDUVSKHAU-UHFFFAOYSA-N
Data  1 IC50
  Tab Delimited (TSV)   2D SDfile   Computed 3D by Vconf -m prep SDfile
Find this compound or compounds like it in BindingDB:
Activity Spreadsheet -- Enzyme Inhibition Constant Data from BindingDB
Found 1 hit for monomerid = 50285344
TargetType-1 angiotensin II receptor(RABBIT)
TBA
Curated by ChEMBL
LigandPNGBDBM50285344(CHEMBL40585 | [4-(7-Methyl-2-propyl-imidazo[4,5-b]...)
Affinity DataIC50:  5nM. Assay description: Tested in vitro for Angiotensin II receptor, type 1 binding affinity using rabbit aorta binding assay
In DepthDetails Article