BDBM50287465 CHEMBL4161349
SMILES CCS(=O)(=O)c1ccc(CC(=O)Nc2nc(c(s2)C(=O)c2ccccc2CC(C)C)-c2ccccc2)cc1
InChI Key InChIKey=JCEZUYLHQPJLPN-UHFFFAOYSA-N
Data  1 IC50  1 EC50
PDB links: 1 PDB ID matches this monomer.
  Tab Delimited (TSV)   2D SDfile   Computed 3D by Vconf -m prep SDfile
Find this compound or compounds like it in BindingDB:
Activity Spreadsheet -- Enzyme Inhibition Constant Data from BindingDB
Found 2 hits for monomerid = 50287465
TargetNuclear receptor ROR-gamma(Homo sapiens (Human))
Fudan University
Curated by ChEMBL
LigandPNGBDBM50287465(CHEMBL4161349)
Affinity DataEC50:  25nM. Assay description: Agonist activity at biotinylated RORgammat LBD (unknown origin) assessed as co-activator SRC1 peptide recruitment after 1 hr by dual FRET based LANCE...
TargetNuclear receptor ROR-gamma(Homo sapiens (Human))
Fudan University
Curated by ChEMBL
LigandPNGBDBM50287465(CHEMBL4161349)
Affinity DataIC50: <2.51E+4nM. Assay description: Inverse agonist activity at APC-labeled RORgammat LBD (unknown origin) assessed as inhibition of N-(2-chloro-6-fluorobenzyl)-N-((2'-methoxy-[1,1'-bip...