BDBM50290809 4-Methyl-3H-benzooxazol-2-one::CHEMBL320850
SMILES Cc1cccc2oc(=O)[nH]c12
InChI Key InChIKey=ZTOHIACMTGKKDU-UHFFFAOYSA-N
Data  3 IC50
  Tab Delimited (TSV)   2D SDfile   Computed 3D by Vconf -m prep SDfile
Find this compound or compounds like it in BindingDB:
Activity Spreadsheet -- Enzyme Inhibition Constant Data from BindingDB
Found 3 hits for monomerid = 50290809
TargetNitric oxide synthase, endothelial(Homo sapiens (Human))
TBA
Curated by ChEMBL
LigandPNGBDBM50290809(4-Methyl-3H-benzooxazol-2-one | CHEMBL320850)
Affinity DataIC50: >5.00E+4nM. Assay description: Inhibitory activity against Endothelial nitric oxide synthase
In DepthDetails Article
TargetNitric oxide synthase, brain(Homo sapiens (Human))
TBA
Curated by ChEMBL
LigandPNGBDBM50290809(4-Methyl-3H-benzooxazol-2-one | CHEMBL320850)
Affinity DataIC50: >5.00E+4nM. Assay description: Inhibitory activity against Neuronal nitric oxide synthase
In DepthDetails Article
TargetNitric oxide synthase, inducible(Homo sapiens (Human))
TBA
Curated by ChEMBL
LigandPNGBDBM50290809(4-Methyl-3H-benzooxazol-2-one | CHEMBL320850)
Affinity DataIC50: >5.00E+4nM. Assay description: Inhibitory activity against Inducible nitric oxide synthase
In DepthDetails Article