BDBM50292068 ({[2-(4-Sulfamoyl-phenyl)-ethylcarbamoyl]-methyl}-amino)-acetic acid::CHEMBL32735
SMILES NS(=O)(=O)c1ccc(CCNC(=O)CNCC(O)=O)cc1
InChI Key InChIKey=LDBNURSRUZWGJX-UHFFFAOYSA-N
Data  3 KI
  Tab Delimited (TSV)   2D SDfile   Computed 3D by Vconf -m prep SDfile
Find this compound or compounds like it in BindingDB:
Activity Spreadsheet -- Enzyme Inhibition Constant Data from BindingDB
Found 3 hits for monomerid = 50292068
TargetCarbonic anhydrase 2(Homo sapiens (Human))
Universit£
Curated by ChEMBL
LigandPNGBDBM50292068(({[2-(4-Sulfamoyl-phenyl)-ethylcarbamoyl]-methyl}-...)
Affinity DataKi:  90nM. Assay description: Inhibitory activity against Human carbonic anhydrase II
In DepthDetails ArticlePubMed
TargetCarbonic anhydrase 4(Bos taurus (bovine))
Universit£
Curated by ChEMBL
LigandPNGBDBM50292068(({[2-(4-Sulfamoyl-phenyl)-ethylcarbamoyl]-methyl}-...)
Affinity DataKi:  257nM. Assay description: Inhibitory activity against bovine carbonic anhydrase IV
In DepthDetails ArticlePubMed
TargetCarbonic anhydrase 1(Homo sapiens (Human))
Universit£
Curated by ChEMBL
LigandPNGBDBM50292068(({[2-(4-Sulfamoyl-phenyl)-ethylcarbamoyl]-methyl}-...)
Affinity DataKi:  3.45E+3nM. Assay description: Inhibitory activity against Human carbonic anhydrase I
In DepthDetails ArticlePubMed