BDBM50301986 2-(6-(3'-(aminomethyl)biphenyl-3-yloxy)-4-(dimethylamino)-3,5-difluoropyridin-2-yloxy)-4-(dimethylamino)benzoic acid::CHEMBL583685
SMILES CN(C)c1ccc(C(O)=O)c(Oc2nc(Oc3cccc(c3)-c3cccc(CN)c3)c(F)c(N(C)C)c2F)c1
InChI Key InChIKey=CJHGABDCRZMJQV-UHFFFAOYSA-N
Data  3 IC50
  Tab Delimited (TSV)   2D SDfile   Computed 3D by Vconf -m prep SDfile
Find this compound or compounds like it in BindingDB:
Activity Spreadsheet -- Enzyme Inhibition Constant Data from BindingDB
Found 3 hits for monomerid = 50301986
TargetPlasminogen(Homo sapiens (Human))
Berlex Biosciences
Curated by ChEMBL
LigandPNGBDBM50301986(2-(6-(3'-(aminomethyl)biphenyl-3-yloxy)-4-(dimethy...)
Affinity DataIC50:  2.90E+3nM. Assay description: Inhibition of plasmin
In DepthDetails ArticlePubMed
TargetUrokinase-type plasminogen activator(Homo sapiens (Human))
Berlex Biosciences
Curated by ChEMBL
LigandPNGBDBM50301986(2-(6-(3'-(aminomethyl)biphenyl-3-yloxy)-4-(dimethy...)
Affinity DataIC50:  530nM. Assay description: Inhibition of uPA
In DepthDetails ArticlePubMed
TargetTissue-type plasminogen activator(Homo sapiens (Human))
Berlex Biosciences
Curated by ChEMBL
LigandPNGBDBM50301986(2-(6-(3'-(aminomethyl)biphenyl-3-yloxy)-4-(dimethy...)
Affinity DataIC50: >3.00E+4nM. Assay description: Inhibition of tPA
In DepthDetails ArticlePubMed