BDBM50303580 (trans-4-Isopropylcyclohexyl)(1-(2-morpholinoethyl)-1H-indol-3-yl)methanone::CHEMBL571344
SMILES CC(C)[C@H]1CC[C@@H](CC1)C(=O)c1cn(CCN2CCOCC2)c2ccccc12
InChI Key InChIKey=BNAHRZBQOFOAKQ-MXVIHJGJSA-N
Data  2 KI  1 EC50
  Tab Delimited (TSV)   2D SDfile   Computed 3D by Vconf -m prep SDfile
Find this compound or compounds like it in BindingDB:
Activity Spreadsheet -- Enzyme Inhibition Constant Data from BindingDB
Found 3 hits for monomerid = 50303580
TargetCannabinoid receptor 2(Homo sapiens (Human))
Abbott Laboratories
Curated by ChEMBL
LigandPNGBDBM50303580((trans-4-Isopropylcyclohexyl)(1-(2-morpholinoethyl...)
Affinity DataKi:  190nM. Assay description: Displacement of [3H]CP-55940 from human recombinant CB2 receptor expressed in HEK293 cells
In DepthDetails ArticlePubMed
TargetCannabinoid receptor 1(Homo sapiens (Human))
Abbott Laboratories
Curated by ChEMBL
LigandPNGBDBM50303580((trans-4-Isopropylcyclohexyl)(1-(2-morpholinoethyl...)
Affinity DataKi: >1.00E+4nM. Assay description: Displacement of [3H]CP-55940 from human recombinant CB1 receptor expressed in CHO cells
In DepthDetails ArticlePubMed
TargetCannabinoid receptor 2(Homo sapiens (Human))
Abbott Laboratories
Curated by ChEMBL
LigandPNGBDBM50303580((trans-4-Isopropylcyclohexyl)(1-(2-morpholinoethyl...)
Affinity DataEC50: >1.00E+4nM. Assay description: Agonist activity at human recombinant CB2 receptor expressed in HEK293 cells coexpressing Galphaq/o5 assessed as calcium mobilization by FLIPR assay
In DepthDetails ArticlePubMed