BDBM50303729 2-amino-4-(2-fluoro-3-(pyrimidin-5-yl)phenyl)-1-methyl-4-(4-(trifluoromethoxy)phenyl)-1H-imidazol-5(4H)-one::CHEMBL566404
SMILES CN1C(N)=NC(C1=O)(c1ccc(OC(F)(F)F)cc1)c1cccc(-c2cncnc2)c1F
InChI Key InChIKey=GYXAUJZSDKKZRQ-UHFFFAOYSA-N
Data  3 IC50  1 EC50
  Tab Delimited (TSV)   2D SDfile   Computed 3D by Vconf -m prep SDfile
Find this compound or compounds like it in BindingDB:
Activity Spreadsheet -- Enzyme Inhibition Constant Data from BindingDB
Found 4 hits for monomerid = 50303729
TargetBeta-secretase 1(Homo sapiens (Human))
Wyeth Research
Curated by ChEMBL
LigandPNGBDBM50303729(2-amino-4-(2-fluoro-3-(pyrimidin-5-yl)phenyl)-1-me...)
Affinity DataIC50:  1.36E+3nM. Assay description: Inhibition of human BACE1 by FRET based peptide cleavage assay
In DepthDetails ArticlePubMed
TargetCathepsin D(Homo sapiens (Human))
Wyeth Research
Curated by ChEMBL
LigandPNGBDBM50303729(2-amino-4-(2-fluoro-3-(pyrimidin-5-yl)phenyl)-1-me...)
Affinity DataIC50:  2.62E+4nM. Assay description: Inhibition of human cathepsin D by FRET based peptide cleavage assay
In DepthDetails ArticlePubMed
TargetBeta-secretase 2(Homo sapiens (Human))
Wyeth Research
Curated by ChEMBL
LigandPNGBDBM50303729(2-amino-4-(2-fluoro-3-(pyrimidin-5-yl)phenyl)-1-me...)
Affinity DataIC50:  5.04E+3nM. Assay description: Inhibition of human BACE2 by FRET based peptide cleavage assay
In DepthDetails ArticlePubMed
TargetBeta-secretase 1(Homo sapiens (Human))
Wyeth Research
Curated by ChEMBL
LigandPNGBDBM50303729(2-amino-4-(2-fluoro-3-(pyrimidin-5-yl)phenyl)-1-me...)
Affinity DataEC50:  2.83E+3nM. Assay description: Inhibition of BACE1 expressed in CHOK1 cells coexpressing human recombinant wild type APP assessed as blockade of amyloid beta production by ELISA
In DepthDetails ArticlePubMed