BDBM50304446 5,6-dimethoxy-2,3-dihydro-1H-inden-1-one::CHEMBL611356
SMILES COc1cc2CCC(=O)c2cc1OC
InChI Key InChIKey=IHMQOBPGHZFGLC-UHFFFAOYSA-N
Data  1 IC50
  Tab Delimited (TSV)   2D SDfile   Computed 3D by Vconf -m prep SDfile
Find this compound or compounds like it in BindingDB:
Activity Spreadsheet -- Enzyme Inhibition Constant Data from BindingDB
Found 1 hit for monomerid = 50304446
TargetGlycogen synthase kinase-3 beta(Homo sapiens (Human))
Instituto De Qu£Mica M£Dica-Csic
Curated by ChEMBL
LigandPNGBDBM50304446(5,6-dimethoxy-2,3-dihydro-1H-inden-1-one | CHEMBL6...)
Affinity DataIC50: >1.00E+5nM. Assay description: Inhibition of GSK3beta by liquid scintillation counting
In DepthDetails ArticlePubMed