BDBM50304505 CHEMBL594949::N4-(3-Methylbenzyl)-6-(4-methylpiperazin-1-yl)pyrimidine-2,4-diamine
SMILES CN1CCN(CC1)c1cc(NCc2cccc(C)c2)nc(N)n1
InChI Key InChIKey=WKSSLPPMNOSQSW-UHFFFAOYSA-N
Data  1 KI
  Tab Delimited (TSV)   2D SDfile   Computed 3D by Vconf -m prep SDfile
Find this compound or compounds like it in BindingDB:
Activity Spreadsheet -- Enzyme Inhibition Constant Data from BindingDB
Found 1 hit for monomerid = 50304505
TargetHistamine H4 receptor(Homo sapiens (Human))
Johann Wolfgang Goethe University
Curated by ChEMBL
LigandPNGBDBM50304505(CHEMBL594949 | N4-(3-Methylbenzyl)-6-(4-methylpipe...)
Affinity DataKi:  282nM. Assay description: Displacement of [3H]histamine from human histamine H4 receptor expressed in Sf9 cells co-expressing Galphai2 and Gbeta1gamma2
In DepthDetails ArticlePubMed