BDBM50304757 3-(4-tert-Butylphenyl)-N-[4-(methylsulfon amido)-3-(trifluoromethyl)benzyl]propanethioamide::CHEMBL605100
SMILES CC(C)(C)c1ccc(CCC(=S)NCc2ccc(NS(C)(=O)=O)c(c2)C(F)(F)F)cc1
InChI Key InChIKey=IYNWFSGMQMALQB-UHFFFAOYSA-N
Data  1 IC50
  Tab Delimited (TSV)   2D SDfile   Computed 3D by Vconf -m prep SDfile
Find this compound or compounds like it in BindingDB:
Activity Spreadsheet -- Enzyme Inhibition Constant Data from BindingDB
Found 1 hit for monomerid = 50304757
TargetTransient receptor potential cation channel subfamily V member 1(Rattus norvegicus (rat))
Seoul National University
Curated by ChEMBL
LigandPNGBDBM50304757(3-(4-tert-Butylphenyl)-N-[4-(methylsulfon amido)-3...)
Affinity DataIC50:  940nM. Assay description: Antagonist activity at TRPV1 in Sprague-Dawley rat DRG neurons assessed as inhibition of capsaicin-induced [45]Ca2+ uptake
In DepthDetails ArticlePubMed