BDBM50304796 (S)-benzyl 1-(2-cyano-1-methyl-2-phenethylhydrazinyl)-1-oxo-3-phenylpropan-2-ylcarbamate::CHEMBL604079::acs.jmedchem.1c00409_ST.402
SMILES CN(N(CCc1ccccc1)C#N)C(=O)[C@H](Cc1ccccc1)NC(=O)OCc1ccccc1
InChI Key InChIKey=MEESNWIPVLGWFL-VWLOTQADSA-N
Data  1 KI  1 IC50
  Tab Delimited (TSV)   2D SDfile   Computed 3D by Vconf -m prep SDfile
Find this compound or compounds like it in BindingDB:
Activity Spreadsheet -- Enzyme Inhibition Constant Data from BindingDB
Found 2 hits for monomerid = 50304796
TargetPapain(Carica papaya)
University Of Queensland
Curated by ChEMBL
LigandPNGBDBM50304796((S)-benzyl 1-(2-cyano-1-methyl-2-phenethylhydrazin...)
Affinity DataKi:  6.30nM. Assay description: Inhibition of Carica papaya papain by microtiter plate spectrofluorimetry
In DepthDetails ArticlePubMed
TargetReplicase polyprotein 1ab(2019-nCoV)
Michigan State University
LigandPNGBDBM50304796((S)-benzyl 1-(2-cyano-1-methyl-2-phenethylhydrazin...)
Affinity DataIC50:  5.36E+3nM. Assay description: This is a review article. Please point to the original journal.
In DepthDetails ArticlePubMed