BDBM50307850 (S)-1-((R)-2-aminobutanoyl)-N-(3-chlorobenzyl)pyrrolidine-2-carboxamide hydrochloride::CHEMBL596780
SMILES CC[C@@H](N)C(=O)N1CCC[C@H]1C(=O)NCc1cccc(Cl)c1
InChI Key InChIKey=OTYYXGRJXJFTCD-KGLIPLIRSA-N
Data  2 KI
PDB links: 1 PDB ID matches this monomer.
  Tab Delimited (TSV)   2D SDfile   Computed 3D by Vconf -m prep SDfile
Find this compound or compounds like it in BindingDB:
Activity Spreadsheet -- Enzyme Inhibition Constant Data from BindingDB
Found 2 hits for monomerid = 50307850
TargetProthrombin(Homo sapiens (Human))
The State University Of New York
Curated by ChEMBL
LigandPNGBDBM50307850((S)-1-((R)-2-aminobutanoyl)-N-(3-chlorobenzyl)pyrr...)
Affinity DataKi:  6.81E+3nM. Assay description: Binding affinity to human thrombin by standard kinetic photometric assay
TargetProthrombin(Homo sapiens (Human))
The State University Of New York
Curated by ChEMBL
LigandPNGBDBM50307850((S)-1-((R)-2-aminobutanoyl)-N-(3-chlorobenzyl)pyrr...)
Affinity DataKi:  1.30E+4nM. Assay description: Inhibition of human alpha-thrombin using tPa (CH3SO2-D-Cha-Gly-Arg-pNA.AcOH) as chromogenic substrate by kinetic photometric assay