BDBM50308000 3-(3,5-dibromo-4-hydroxybenzoyl)-2-ethyl-N-(thiazol-2-yl)benzofuran-6-sulfonamide::CHEMBL598832
SMILES CCc1oc2cc(ccc2c1C(=O)c1cc(Br)c(O)c(Br)c1)S(=O)(=O)Nc1nccs1
InChI Key InChIKey=KTISQHZPQUEIPS-UHFFFAOYSA-N
Data  6 IC50
  Tab Delimited (TSV)   2D SDfile   Computed 3D by Vconf -m prep SDfile
Find this compound or compounds like it in BindingDB:
Activity Spreadsheet -- Enzyme Inhibition Constant Data from BindingDB
Found 6 hits for monomerid = 50308000
TargetSerine/threonine-protein phosphatase 2A activator(Homo sapiens (Human))
Chinese Academy Of Sciences
Curated by ChEMBL
LigandPNGBDBM50308000(3-(3,5-dibromo-4-hydroxybenzoyl)-2-ethyl-N-(thiazo...)
Affinity DataIC50: >1.00E+5nM. Assay description: Inhibition of PTPalpha expressed in Escherichia coli BL21 (DE3) after 10 mins by spectrophotometry
In DepthDetails ArticlePubMed
TargetTyrosine-protein phosphatase non-receptor type 1(Homo sapiens (Human))
Chinese Academy Of Sciences
Curated by ChEMBL
LigandPNGBDBM50308000(3-(3,5-dibromo-4-hydroxybenzoyl)-2-ethyl-N-(thiazo...)
Affinity DataIC50:  3.00E+3nM. Assay description: Inhibition of PTP1B expressed in Escherichia coli BL21 (DE3) after 10 mins by spectrophotometry
In DepthDetails ArticlePubMed
TargetReceptor-type tyrosine-protein phosphatase F(Homo sapiens (Human))
Chinese Academy Of Sciences
Curated by ChEMBL
LigandPNGBDBM50308000(3-(3,5-dibromo-4-hydroxybenzoyl)-2-ethyl-N-(thiazo...)
Affinity DataIC50: >1.00E+5nM. Assay description: Inhibition of LAR expressed in Escherichia coli BL21 (DE3) after 10 mins by spectrophotometry
In DepthDetails ArticlePubMed
TargetTyrosine-protein phosphatase non-receptor type 2(Homo sapiens (Human))
Chinese Academy Of Sciences
Curated by ChEMBL
LigandPNGBDBM50308000(3-(3,5-dibromo-4-hydroxybenzoyl)-2-ethyl-N-(thiazo...)
Affinity DataIC50:  2.18E+4nM. Assay description: Inhibition of TCPTP expressed in Escherichia coli BL21 (DE3) after 10 mins by spectrophotometry
In DepthDetails ArticlePubMed
TargetReceptor-type tyrosine-protein phosphatase C(Homo sapiens (Human))
Chinese Academy Of Sciences
Curated by ChEMBL
LigandPNGBDBM50308000(3-(3,5-dibromo-4-hydroxybenzoyl)-2-ethyl-N-(thiazo...)
Affinity DataIC50:  6.67E+4nM. Assay description: Inhibition of CD45 expressed in Escherichia coli BL21 (DE3) after 10 mins by spectrophotometry
In DepthDetails ArticlePubMed
TargetTyrosine-protein phosphatase non-receptor type 1(Homo sapiens (Human))
Chinese Academy Of Sciences
Curated by ChEMBL
LigandPNGBDBM50308000(3-(3,5-dibromo-4-hydroxybenzoyl)-2-ethyl-N-(thiazo...)
Affinity DataIC50:  8.00E+3nM. Assay description: Allosteric inhibition of PTP1B
In DepthDetails ArticlePubMed