BDBM50310902 (5-methylthiophen-2-yl)(2-(pyridin-3-ylmethylamino)thieno[3,2-d]pyrimidin-4-yl)methanone::CHEMBL1078349
SMILES Cc1ccc(s1)C(=O)c1nc(NCc2cccnc2)nc2ccsc12
InChI Key InChIKey=KGXPCXWPSGPYLH-UHFFFAOYSA-N
Data  2 IC50
  Tab Delimited (TSV)   2D SDfile   Computed 3D by Vconf -m prep SDfile
Find this compound or compounds like it in BindingDB:
Activity Spreadsheet -- Enzyme Inhibition Constant Data from BindingDB
Found 2 hits for monomerid = 50310902
TargetAdenosine receptor A2a(Homo sapiens (Human))
Vernalis (R&D)
Curated by ChEMBL
LigandPNGBDBM50310902((5-methylthiophen-2-yl)(2-(pyridin-3-ylmethylamino...)
Affinity DataIC50:  990nM. Assay description: Antagonist activity at human adeosine A2A receptor expressed in CHOK1 cells assessed as inhibition of calcium mobilization by FLIPR assay
In DepthDetails ArticlePubMed
TargetAdenosine receptor A2b(Homo sapiens (Human))
Vernalis (R&D)
Curated by ChEMBL
LigandPNGBDBM50310902((5-methylthiophen-2-yl)(2-(pyridin-3-ylmethylamino...)
Affinity DataIC50:  55nM. Assay description: Antagonist activity at human adeosine A2B receptor expressed in CHOK1 cells assessed as inhibition of calcium mobilization by FLIPR assay
In DepthDetails ArticlePubMed