BDBM50313464 4-propyl-6-(4-(trifluoromethyl)phenyl)pyrimidine-2-carbonitrile::CHEMBL1079099
SMILES CCCc1cc(nc(n1)C#N)-c1ccc(cc1)C(F)(F)F
InChI Key InChIKey=YAQSQYLEPKUMCU-UHFFFAOYSA-N
Data  6 IC50
  Tab Delimited (TSV)   2D SDfile   Computed 3D by Vconf -m prep SDfile
Find this compound or compounds like it in BindingDB:
Activity Spreadsheet -- Enzyme Inhibition Constant Data from BindingDB
Found 6 hits for monomerid = 50313464
TargetCathepsin K(Homo sapiens (Human))
Schering-Plough
Curated by ChEMBL
LigandPNGBDBM50313464(4-propyl-6-(4-(trifluoromethyl)phenyl)pyrimidine-2...)
Affinity DataIC50:  1.00E+3nM. Assay description: Inhibition of human recombinant cathepsin K by fluorescence assay
In DepthDetails ArticlePubMed
TargetCathepsin S(Homo sapiens (Human))
Schering-Plough
Curated by ChEMBL
LigandPNGBDBM50313464(4-propyl-6-(4-(trifluoromethyl)phenyl)pyrimidine-2...)
Affinity DataIC50:  1.26E+3nM. Assay description: Inhibition of human recombinant cathepsin S by fluorescence assay
In DepthDetails ArticlePubMed
TargetCathepsin B(Homo sapiens (Human))
Merck Research Laboratories
Curated by ChEMBL
LigandPNGBDBM50313464(4-propyl-6-(4-(trifluoromethyl)phenyl)pyrimidine-2...)
Affinity DataIC50: >1.00E+4nM. Assay description: Inhibition of human recombinant cathepsin B
In DepthDetails ArticlePubMed
TargetCathepsin S(Homo sapiens (Human))
Schering-Plough
Curated by ChEMBL
LigandPNGBDBM50313464(4-propyl-6-(4-(trifluoromethyl)phenyl)pyrimidine-2...)
Affinity DataIC50:  1.26E+3nM. Assay description: Inhibition of human recombinant cathepsin S
In DepthDetails ArticlePubMed
TargetCathepsin K(Homo sapiens (Human))
Schering-Plough
Curated by ChEMBL
LigandPNGBDBM50313464(4-propyl-6-(4-(trifluoromethyl)phenyl)pyrimidine-2...)
Affinity DataIC50:  977nM. Assay description: Inhibition of human recombinant cathepsin K
In DepthDetails ArticlePubMed
TargetProcathepsin L(Homo sapiens (Human))
Merck Research Laboratories
Curated by ChEMBL
LigandPNGBDBM50313464(4-propyl-6-(4-(trifluoromethyl)phenyl)pyrimidine-2...)
Affinity DataIC50: >1.00E+4nM. Assay description: Inhibition of human recombinant cathepsin L
In DepthDetails ArticlePubMed