BDBM50314166 1-(1-(3-(5-(methylsulfonyl)-3-(3-(2-morpholinoethylthio)-4-(trifluoromethyl)phenyl)-4,5,6,7-tetrahydro-1H-pyrazolo[4,3-c]pyridin-1-yl)propyl)piperidin-4-yl)pyrrolidin-2-one::CHEMBL1093954
SMILES CS(=O)(=O)N1CCc2c(C1)c(nn2CCCN1CCC(CC1)N1CCCC1=O)-c1ccc(c(SCCN2CCOCC2)c1)C(F)(F)F
InChI Key InChIKey=YRJGKWOLNCEMFB-UHFFFAOYSA-N
Data  2 IC50
  Tab Delimited (TSV)   2D SDfile   Computed 3D by Vconf -m prep SDfile
Find this compound or compounds like it in BindingDB:
Activity Spreadsheet -- Enzyme Inhibition Constant Data from BindingDB
Found 2 hits for monomerid = 50314166
TargetCathepsin S(Homo sapiens (Human))
Johnson & Johnson Pharmaceutical Research & Development
Curated by ChEMBL
LigandPNGBDBM50314166(1-(1-(3-(5-(methylsulfonyl)-3-(3-(2-morpholinoethy...)
Affinity DataIC50:  680nM. Assay description: Inhibition of cathepsin S in human JY cells assessed as inhibition of invariant chain degradation
In DepthDetails ArticlePubMed
TargetCathepsin S(Homo sapiens (Human))
Johnson & Johnson Pharmaceutical Research & Development
Curated by ChEMBL
LigandPNGBDBM50314166(1-(1-(3-(5-(methylsulfonyl)-3-(3-(2-morpholinoethy...)
Affinity DataIC50:  270nM. Assay description: Inhibition of human cathepsin S
In DepthDetails ArticlePubMed