BDBM50314239 CHEMBL1090994::rac-2-(5-(1-(2-hydroxy-3-(4-(pyridin-2-yl)piperidin-1-yl)propyl)-5-(methylsulfonyl)-4,5,6,7-tetrahydro-1H-pyrazolo[4,3-c]pyridin-3-yl)-2-(trifluoromethyl)phenylthio)-1-((R)-3-hydroxypyrrolidin-1-yl)ethanone
SMILES CS(=O)(=O)N1CCc2c(C1)c(nn2CC(O)CN1CCC(CC1)c1ccccn1)-c1ccc(c(SCC(=O)N2CC[C@@H](O)C2)c1)C(F)(F)F
InChI Key InChIKey=OYXMEFKTEQQIOT-IKOFQBKESA-N
Data  2 IC50
  Tab Delimited (TSV)   2D SDfile   Computed 3D by Vconf -m prep SDfile
Find this compound or compounds like it in BindingDB:
Activity Spreadsheet -- Enzyme Inhibition Constant Data from BindingDB
Found 2 hits for monomerid = 50314239
TargetCathepsin S(Homo sapiens (Human))
Johnson & Johnson Pharmaceutical Research & Development
Curated by ChEMBL
LigandPNGBDBM50314239(CHEMBL1090994 | rac-2-(5-(1-(2-hydroxy-3-(4-(pyrid...)
Affinity DataIC50:  30nM. Assay description: Inhibition of cathepsin S in human JY cells assessed as accumulation of invariant chain p10li after 24 hrs by Western blot analysis
In DepthDetails ArticlePubMed
TargetCathepsin S(Homo sapiens (Human))
Johnson & Johnson Pharmaceutical Research & Development
Curated by ChEMBL
LigandPNGBDBM50314239(CHEMBL1090994 | rac-2-(5-(1-(2-hydroxy-3-(4-(pyrid...)
Affinity DataIC50:  7nM. Assay description: Inhibition of human recombinant cathepsin S expressed in baculovirus expression sytem after 15 mins by FRET assay
In DepthDetails ArticlePubMed