BDBM50317939 3-(3-(2-benzyl-4-methyl-1-phenethyl-1H-imidazol-5-yl)phenyl)-N-hydroxyacrylamide::CHEMBL1094094
SMILES Cc1nc(Cc2ccccc2)n(CCc2ccccc2)c1-c1cccc(\C=C\C(=O)NO)c1
InChI Key InChIKey=VINFAVNHTFQZFB-FOCLMDBBSA-N
Data  3 IC50
  Tab Delimited (TSV)   2D SDfile   Computed 3D by Vconf -m prep SDfile
Find this compound or compounds like it in BindingDB:
Activity Spreadsheet -- Enzyme Inhibition Constant Data from BindingDB
Found 3 hits for monomerid = 50317939
TargetHistone deacetylase 1(Homo sapiens (Human))
Takeda California
Curated by ChEMBL
LigandPNGBDBM50317939(3-(3-(2-benzyl-4-methyl-1-phenethyl-1H-imidazol-5-...)
Affinity DataIC50:  40nM. Assay description: Inhibition of human recombinant HDAC2
In DepthDetails ArticlePubMed
TargetHistone deacetylase 8(Homo sapiens (Human))
Takeda California
Curated by ChEMBL
LigandPNGBDBM50317939(3-(3-(2-benzyl-4-methyl-1-phenethyl-1H-imidazol-5-...)
Affinity DataIC50:  63nM. Assay description: Inhibition of human recombinant HDAC8
In DepthDetails ArticlePubMed
TargetHistone deacetylase 6(Homo sapiens (Human))
Takeda California
Curated by ChEMBL
LigandPNGBDBM50317939(3-(3-(2-benzyl-4-methyl-1-phenethyl-1H-imidazol-5-...)
Affinity DataIC50:  63nM. Assay description: Inhibition of human recombinant HDAC6
In DepthDetails ArticlePubMed