BDBM50318050 1-benzyl-4-(benzyloxy)-3-bromopyridin-2(1H)-one::CHEMBL1095447::SC-25028
SMILES Brc1c(OCc2ccccc2)ccn(Cc2ccccc2)c1=O
InChI Key InChIKey=VBZTXJCTVYBOKW-UHFFFAOYSA-N
Data  4 IC50
PDB links: 1 PDB ID matches this monomer.
  Tab Delimited (TSV)   2D SDfile   Computed 3D by Vconf -m prep SDfile
Find this compound or compounds like it in BindingDB:
Activity Spreadsheet -- Enzyme Inhibition Constant Data from BindingDB
Found 4 hits for monomerid = 50318050
TargetMitogen-activated protein kinase 9(Homo sapiens (Human))
Pfizer
Curated by ChEMBL
LigandPNGBDBM50318050(1-benzyl-4-(benzyloxy)-3-bromopyridin-2(1H)-one | ...)
Affinity DataIC50: >2.00E+5nM. Assay description: Inhibition of JNK2
In DepthDetails ArticlePubMed
TargetMitogen-activated protein kinase 9(Homo sapiens (Human))
Pfizer
Curated by ChEMBL
LigandPNGBDBM50318050(1-benzyl-4-(benzyloxy)-3-bromopyridin-2(1H)-one | ...)
Affinity DataIC50: >2.00E+5nM. Assay description: Inhibition of JNK2
In DepthDetails ArticlePubMed
TargetMitogen-activated protein kinase 14(Homo sapiens (Human))
Pfizer
Curated by ChEMBL
LigandPNGBDBM50318050(1-benzyl-4-(benzyloxy)-3-bromopyridin-2(1H)-one | ...)
Affinity DataIC50:  680nM. Assay description: Inhibition of p38alpha
TargetMitogen-activated protein kinase 14(Homo sapiens (Human))
Pfizer
Curated by ChEMBL
LigandPNGBDBM50318050(1-benzyl-4-(benzyloxy)-3-bromopyridin-2(1H)-one | ...)
Affinity DataIC50:  680nM. Assay description: Inhibition of p38alpha