BDBM50319983 3-(pyridin-4-yl)-N-(2-(trifluoromethoxy)benzyl)pyrrolidine-1-carboxamide::CHEMBL1085745
SMILES FC(F)(F)Oc1ccccc1CNC(=O)N1CCC(C1)c1ccncc1
InChI Key InChIKey=QCMYNIHAZUWGBC-UHFFFAOYSA-N
Data  6 IC50
  Tab Delimited (TSV)   2D SDfile   Computed 3D by Vconf -m prep SDfile
Find this compound or compounds like it in BindingDB:
Activity Spreadsheet -- Enzyme Inhibition Constant Data from BindingDB
Found 6 hits for monomerid = 50319983
TargetBifunctional epoxide hydrolase 2(Homo sapiens (Human))
Boehringer Ingelheim Pharmaceuticals
Curated by ChEMBL
LigandPNGBDBM50319983(3-(pyridin-4-yl)-N-(2-(trifluoromethoxy)benzyl)pyr...)
Affinity DataIC50:  76nM. Assay description: Inhibition of human soluble epoxide hydrolase assessed as [2-3H]-trans-1,3-diphenyl propylene oxide hydrolysis by cellular assay
In DepthDetails ArticlePubMed
TargetBifunctional epoxide hydrolase 2(Homo sapiens (Human))
Boehringer Ingelheim Pharmaceuticals
Curated by ChEMBL
LigandPNGBDBM50319983(3-(pyridin-4-yl)-N-(2-(trifluoromethoxy)benzyl)pyr...)
Affinity DataIC50:  7nM. Assay description: Inhibition of human soluble epoxide hydrolase
In DepthDetails ArticlePubMed
TargetCytochrome P450 2C9(Homo sapiens (Human))
Merck Research Laboratories
Curated by ChEMBL
LigandPNGBDBM50319983(3-(pyridin-4-yl)-N-(2-(trifluoromethoxy)benzyl)pyr...)
Affinity DataIC50: >300nM. Assay description: Inhibition of CYP2C9
In DepthDetails ArticlePubMed
TargetCytochrome P450 2C9(Homo sapiens (Human))
Merck Research Laboratories
Curated by ChEMBL
LigandPNGBDBM50319983(3-(pyridin-4-yl)-N-(2-(trifluoromethoxy)benzyl)pyr...)
Affinity DataIC50:  300nM. Assay description: Inhibition of CYP2C9
In DepthDetails ArticlePubMed
TargetCytochrome P450 2J2(Homo sapiens (Human))
Merck Research Laboratories
Curated by ChEMBL
LigandPNGBDBM50319983(3-(pyridin-4-yl)-N-(2-(trifluoromethoxy)benzyl)pyr...)
Affinity DataIC50: >1.00E+4nM. Assay description: Inhibition of CYP2J2
In DepthDetails ArticlePubMed
TargetCytochrome P450 2J2(Homo sapiens (Human))
Merck Research Laboratories
Curated by ChEMBL
LigandPNGBDBM50319983(3-(pyridin-4-yl)-N-(2-(trifluoromethoxy)benzyl)pyr...)
Affinity DataIC50:  1.00E+4nM. Assay description: Inhibition of CYP2J2
In DepthDetails ArticlePubMed