BDBM50320940 (3S,20S,23S)-3-(4'-Methoxybenzoyloxy)-20,23-dihydroxydammar-24-en-21-oic acid-21,23-lactone::CHEMBL1164944
SMILES [#6]-[#8]-c1ccc(cc1)-[#6](=O)-[#8]-[#6@H]1-[#6]-[#6][C@@]2([#6])[#6@@H](-[#6]-[#6][C@@]3([#6])[#6@@H]-4-[#6]-[#6]-[#6@@H](-[#6@H]-4-[#6]-[#6]-[#6@H]23)[C@@]2([#8])[#6]-[#6@H](-[#8]-[#6]2=O)\[#6]=[#6](\[#6])-[#6])C1([#6])[#6]
InChI Key InChIKey=QIQHLKXFJJLZSA-FDZYGETKSA-N
Data  2 IC50
  Tab Delimited (TSV)   2D SDfile   Computed 3D by Vconf -m prep SDfile
Find this compound or compounds like it in BindingDB:
Activity Spreadsheet -- Enzyme Inhibition Constant Data from BindingDB
Found 2 hits for monomerid = 50320940
TargetTyrosine-protein phosphatase non-receptor type 2(Homo sapiens (Human))
Chinese Academy Of Sciences
Curated by ChEMBL
LigandPNGBDBM50320940((3S,20S,23S)-3-(4'-Methoxybenzoyloxy)-20,23-dihydr...)
Affinity DataIC50:  3.90E+3nM. Assay description: Inhibition of TCPTP by pNPP hydrolase assay
In DepthDetails ArticlePubMed
TargetTyrosine-protein phosphatase non-receptor type 1(Homo sapiens (Human))
Chinese Academy Of Sciences
Curated by ChEMBL
LigandPNGBDBM50320940((3S,20S,23S)-3-(4'-Methoxybenzoyloxy)-20,23-dihydr...)
Affinity DataIC50:  2.61E+3nM. Assay description: Inhibition of PTP1B by pNPP hydrolase assay
In DepthDetails ArticlePubMed