BDBM50323270 6-(4-(2-hydroxyethoxy)-3-(trifluoromethyl)phenyl)-1H-imidazo[4,5-c]pyridine-4-carbonitrile::CHEMBL1209857
SMILES OCCOc1ccc(cc1C(F)(F)F)-c1cc2nc[nH]c2c(n1)C#N
InChI Key InChIKey=XFRQPGFEYYYCRM-UHFFFAOYSA-N
Data  2 IC50
  Tab Delimited (TSV)   2D SDfile   Computed 3D by Vconf -m prep SDfile
Find this compound or compounds like it in BindingDB:
Activity Spreadsheet -- Enzyme Inhibition Constant Data from BindingDB
Found 2 hits for monomerid = 50323270
TargetCathepsin S(Homo sapiens (Human))
Merck Research Laboratories
Curated by ChEMBL
LigandPNGBDBM50323270(6-(4-(2-hydroxyethoxy)-3-(trifluoromethyl)phenyl)-...)
Affinity DataIC50:  145nM. Assay description: Inhibition of human cathepsin S by fluorescence assay
In DepthDetails ArticlePubMed
TargetCathepsin K(Homo sapiens (Human))
Merck Research Laboratories
Curated by ChEMBL
LigandPNGBDBM50323270(6-(4-(2-hydroxyethoxy)-3-(trifluoromethyl)phenyl)-...)
Affinity DataIC50:  2.82E+3nM. Assay description: Inhibition of human cathepsin K by fluorescence assay
In DepthDetails ArticlePubMed