BDBM50324134 3-tert-butyl 5-methyl 4-(4-hydroxyphenyl)-2,6-dimethyl-1,4-dihydropyridine-3,5-dicarboxylate::CHEMBL1215194
SMILES COC(=O)C1C(C(C(=O)OC(C)(C)C)=C(C)N=C1C)c1ccc(O)cc1
InChI Key InChIKey=ODNRMADAEHKFII-UHFFFAOYSA-N
Data  1 IC50
  Tab Delimited (TSV)   2D SDfile   Computed 3D by Vconf -m prep SDfile
Find this compound or compounds like it in BindingDB:
Activity Spreadsheet -- Enzyme Inhibition Constant Data from BindingDB
Found 1 hit for monomerid = 50324134
TargetMineralocorticoid receptor(Homo sapiens (Human))
Pfizer
Curated by ChEMBL
LigandPNGBDBM50324134(3-tert-butyl 5-methyl 4-(4-hydroxyphenyl)-2,6-dime...)
Affinity DataIC50:  2.57E+3nM. Assay description: Antagonist activity at mineralocorticoid receptor LBD expressed in human HUH7 cells coexpressing GAL4 by luciferase reporter gene assay
In DepthDetails ArticlePubMed