BDBM50329046 (2-benzyl-1-phenyl-1H-indol-3-yl)(piperazin-1-yl)methanone::2-benzyl-1-phenyl-3-(piperazin-1-ylcarbonyl)-1H-indole::CHEMBL1235802
SMILES O=C(N1CCNCC1)c1c(Cc2ccccc2)n(-c2ccccc2)c2ccccc12
InChI Key InChIKey=FYDPGAJRQXSCCK-UHFFFAOYSA-N
Data  1 IC50
PDB links: 1 PDB ID matches this monomer.
  Tab Delimited (TSV)   2D SDfile   Computed 3D by Vconf -m prep SDfile
Find this compound or compounds like it in BindingDB:
Activity Spreadsheet -- Enzyme Inhibition Constant Data from BindingDB
Found 1 hit for monomerid = 50329046
TargetRenin(Homo sapiens (Human))
Sanofi-Aventis Deutschland
Curated by ChEMBL
LigandPNGBDBM50329046((2-benzyl-1-phenyl-1H-indol-3-yl)(piperazin-1-yl)m...)
Affinity DataIC50:  91nM. Assay description: Inhibition of human recombinant renin using flurorogenic substrate by microplate spectrofluorometer