BDBM50329986 6-tert-butyl-2-(2'-fluorobiphenyl-4-yl)-1H-benzo[d]imidazole::CHEMBL1272145
SMILES CC(C)(C)c1ccc2nc([nH]c2c1)-c1ccc(cc1)-c1ccccc1F
InChI Key InChIKey=CTZLXTQEVUMJMU-UHFFFAOYSA-N
Data  3 IC50
  Tab Delimited (TSV)   2D SDfile   Computed 3D by Vconf -m prep SDfile
Find this compound or compounds like it in BindingDB:
Activity Spreadsheet -- Enzyme Inhibition Constant Data from BindingDB
Found 3 hits for monomerid = 50329986
TargetStearoyl-CoA desaturase 5(Homo sapiens (Human))
Merck Frosst Centre For Therapeutic Research
Curated by ChEMBL
LigandPNGBDBM50329986(6-tert-butyl-2-(2'-fluorobiphenyl-4-yl)-1H-benzo[d...)
Affinity DataIC50: >2.00E+4nM. Assay description: Inhibition of human SCD5
In DepthDetails ArticlePubMed
TargetStearoyl-CoA desaturase(Homo sapiens (Human))
Merck Frosst Centre For Therapeutic Research
Curated by ChEMBL
LigandPNGBDBM50329986(6-tert-butyl-2-(2'-fluorobiphenyl-4-yl)-1H-benzo[d...)
Affinity DataIC50:  731nM. Assay description: Inhibition of human SCD1
In DepthDetails ArticlePubMed
TargetAcyl-CoA desaturase 1(Rattus norvegicus (Rat))
Merck Frosst Centre For Therapeutic Research
Curated by ChEMBL
LigandPNGBDBM50329986(6-tert-butyl-2-(2'-fluorobiphenyl-4-yl)-1H-benzo[d...)
Affinity DataIC50:  175nM. Assay description: Inhibition of rat SCD1
In DepthDetails ArticlePubMed