BDBM50330576 4-(3-amino-6-(3,4,5-trimethoxyphenyl)pyrazin-2-yl)-2-methoxybenzoic acid::4-[3-amino-6-(3,4,5-trimethoxyphenyl)pyrazin-2-yl]-2-methoxybenzoic acid::CHEMBL1230435
SMILES COc1cc(ccc1C(O)=O)-c1nc(cnc1N)-c1cc(OC)c(OC)c(OC)c1
InChI Key InChIKey=QYMUPWSODGEMOO-UHFFFAOYSA-N
Data  3 IC50
PDB links: 1 PDB ID matches this monomer.
  Tab Delimited (TSV)   2D SDfile   Computed 3D by Vconf -m prep SDfile
Find this compound or compounds like it in BindingDB:
Activity Spreadsheet -- Enzyme Inhibition Constant Data from BindingDB
Found 3 hits for monomerid = 50330576
TargetSerine/threonine-protein kinase Nek2(Homo sapiens (Human))
The Institute Of Cancer Research
Curated by ChEMBL
LigandPNGBDBM50330576(4-(3-amino-6-(3,4,5-trimethoxyphenyl)pyrazin-2-yl)...)
Affinity DataIC50:  1.30E+3nM. Assay description: Inhibition of NEK2 autophosphorylation after 2 hrs by DELFIA assay
TargetSerine/threonine-protein kinase Nek2(Homo sapiens (Human))
The Institute Of Cancer Research
Curated by ChEMBL
LigandPNGBDBM50330576(4-(3-amino-6-(3,4,5-trimethoxyphenyl)pyrazin-2-yl)...)
Affinity DataIC50:  2.50E+3nM. Assay description: Inhibition of NEK2 assessed as inhibition of substrate phosphorylation
TargetSerine/threonine-protein kinase Nek2(Homo sapiens (Human))
The Institute Of Cancer Research
Curated by ChEMBL
LigandPNGBDBM50330576(4-(3-amino-6-(3,4,5-trimethoxyphenyl)pyrazin-2-yl)...)
Affinity DataIC50:  2.40E+3nM. Assay description: Inhibition of NEK2 by microfluidic assay