BDBM50337294 1-(2,6-dichlorobenzyl)-3-(3-(2-(2-hydroxy-2-(8-hydroxy-2-oxo-1,2-dihydroquinolin-5-yl)ethylamino)ethyl)phenyl)urea::CHEMBL1682217
SMILES OC(CNCCc1cccc(NC(=O)NCc2c(Cl)cccc2Cl)c1)c1ccc(O)c2[nH]c(=O)ccc12
InChI Key InChIKey=AGRBGRIZVSNPBG-UHFFFAOYSA-N
Data  2 EC50
  Tab Delimited (TSV)   2D SDfile   Computed 3D by Vconf -m prep SDfile
Find this compound or compounds like it in BindingDB:
Activity Spreadsheet -- Enzyme Inhibition Constant Data from BindingDB
Found 2 hits for monomerid = 50337294
TargetBeta-2 adrenergic receptor(GUINEA PIG)
RhôNe-Poulenc Rorer
Curated by ChEMBL
LigandPNGBDBM50337294(1-(2,6-dichlorobenzyl)-3-(3-(2-(2-hydroxy-2-(8-hyd...)
Affinity DataEC50:  0.200nM. Assay description: Agonist activity at beta2 adrenoreceptor in guinea pig tracheal rings assessed as vasorelaxation
In DepthDetails ArticlePubMed
TargetBeta-1 adrenergic receptor(Rattus norvegicus (Rat))
RhôNe-Poulenc Rorer
Curated by ChEMBL
LigandPNGBDBM50337294(1-(2,6-dichlorobenzyl)-3-(3-(2-(2-hydroxy-2-(8-hyd...)
Affinity DataEC50:  1.60E+3nM. Assay description: Agonist activity at beta1 adrenoreceptor in rat left atria assessed as induction of ionotropic effect
In DepthDetails ArticlePubMed