BDBM50337296 1-(biphenyl-2-yl)-3-(3-(2-(2-hydroxy-2-(8-hydroxy-2-oxo-1,2-dihydroquinolin-5-yl)ethylamino)ethyl)phenyl)urea::CHEMBL1682219
SMILES OC(CNCCc1cccc(NC(=O)Nc2ccccc2-c2ccccc2)c1)c1ccc(O)c2[nH]c(=O)ccc12
InChI Key InChIKey=XWOZZFOEVKMVJC-UHFFFAOYSA-N
Data  2 EC50
  Tab Delimited (TSV)   2D SDfile   Computed 3D by Vconf -m prep SDfile
Find this compound or compounds like it in BindingDB:
Activity Spreadsheet -- Enzyme Inhibition Constant Data from BindingDB
Found 2 hits for monomerid = 50337296
TargetBeta-2 adrenergic receptor(GUINEA PIG)
RhôNe-Poulenc Rorer
Curated by ChEMBL
LigandPNGBDBM50337296(1-(biphenyl-2-yl)-3-(3-(2-(2-hydroxy-2-(8-hydroxy-...)
Affinity DataEC50:  0.700nM. Assay description: Agonist activity at beta2 adrenoreceptor in guinea pig tracheal rings assessed as vasorelaxation
In DepthDetails ArticlePubMed
TargetBeta-1 adrenergic receptor(Rattus norvegicus (Rat))
RhôNe-Poulenc Rorer
Curated by ChEMBL
LigandPNGBDBM50337296(1-(biphenyl-2-yl)-3-(3-(2-(2-hydroxy-2-(8-hydroxy-...)
Affinity DataEC50:  5.77E+3nM. Assay description: Agonist activity at beta1 adrenoreceptor in rat left atria assessed as induction of ionotropic effect
In DepthDetails ArticlePubMed