BDBM50337487 CHEMBL1682773::methyl 2-(4-chloro-2-(2-(3-(diisobutylcarbamoyl)-5-methylphenoxy)ethyl)phenoxy)acetate
SMILES COC(=O)COc1ccc(Cl)cc1CCOc1cc(C)cc(c1)C(=O)N(CC(C)C)CC(C)C
InChI Key InChIKey=JCOYICOWNXQLOH-UHFFFAOYSA-N
Data  1 KI
  Tab Delimited (TSV)   2D SDfile   Computed 3D by Vconf -m prep SDfile
Find this compound or compounds like it in BindingDB:
Activity Spreadsheet -- Enzyme Inhibition Constant Data from BindingDB
Found 1 hit for monomerid = 50337487
TargetProthrombin(Homo sapiens (Human))
Merck Research Laboratories
Curated by ChEMBL
LigandPNGBDBM50337487(CHEMBL1682773 | methyl 2-(4-chloro-2-(2-(3-(diisob...)
Affinity DataKi:  0.730nM. Assay description: Inhibition of thrombin
In DepthDetails ArticlePubMed