BDBM50341977 2-(2,5-dimethyl-1H-pyrrol-1-yl)-5-hydroxybenzoic acid::CHEMBL1765360
SMILES Cc1ccc(C)n1-c1ccc(O)cc1C(O)=O
InChI Key InChIKey=BTNJQFIFTBDRAH-UHFFFAOYSA-N
Data  3 KI
PDB links: 1 PDB ID matches this monomer.
  Tab Delimited (TSV)   2D SDfile   Computed 3D by Vconf -m prep SDfile
Find this compound or compounds like it in BindingDB:
Activity Spreadsheet -- Enzyme Inhibition Constant Data from BindingDB
Found 3 hits for monomerid = 50341977
TargetLow molecular weight protein-tyrosine phosphatase A(Mycobacterium tuberculosis)
Max Planck Institute Of Molecular Physiology
Curated by ChEMBL
LigandPNGBDBM50341977(2-(2,5-dimethyl-1H-pyrrol-1-yl)-5-hydroxybenzoic a...)
Affinity DataKi:  1.60E+3nM. Assay description: Inhibition of Mycobacterium tuberculosis ptpA
In DepthDetails ArticlePubMed
TargetLow molecular weight protein-tyrosine phosphatase A(Mycobacterium tuberculosis)
Max Planck Institute Of Molecular Physiology
Curated by ChEMBL
LigandPNGBDBM50341977(2-(2,5-dimethyl-1H-pyrrol-1-yl)-5-hydroxybenzoic a...)
Affinity DataKi:  1.60E+3nM. Assay description: Inhibition of Mycobacterium tuberculosis PtpA
In DepthDetails ArticlePubMed
TargetTyrosine-protein phosphatase non-receptor type 1(Homo sapiens (Human))
Max Planck Institute Of Molecular Physiology
Curated by ChEMBL
LigandPNGBDBM50341977(2-(2,5-dimethyl-1H-pyrrol-1-yl)-5-hydroxybenzoic a...)
Affinity DataKi:  3.00E+3nM. Assay description: Inhibition of PTP1B