BDBM50342219 CHEMBL1766443::N-(3-Cyanophenyl)-2-(4-(4-methoxyquinolin-6-yl)-3-(6-methylpyridin-2-yl)-1H-pyrazol-1-yl)acetamide
SMILES COc1ccnc2ccc(cc12)-c1cn(CC(=O)Nc2cccc(c2)C#N)nc1-c1cccc(C)n1
InChI Key InChIKey=AFVKISLMRSPHQO-UHFFFAOYSA-N
Data  2 IC50
  Tab Delimited (TSV)   2D SDfile   Computed 3D by Vconf -m prep SDfile
Find this compound or compounds like it in BindingDB:
Activity Spreadsheet -- Enzyme Inhibition Constant Data from BindingDB
Found 2 hits for monomerid = 50342219
TargetTGF-beta receptor type-1(Homo sapiens (Human))
Ewha Womans University
Curated by ChEMBL
LigandPNGBDBM50342219(CHEMBL1766443 | N-(3-Cyanophenyl)-2-(4-(4-methoxyq...)
Affinity DataIC50: >1.00E+3nM. Assay description: Inhibition of human recombinant p38alpha expressed in Escherichia coli using ATF2 as a substrate by radioisotopic protein kinase assay
In DepthDetails ArticlePubMed
TargetTGF-beta receptor type-1(Homo sapiens (Human))
Ewha Womans University
Curated by ChEMBL
LigandPNGBDBM50342219(CHEMBL1766443 | N-(3-Cyanophenyl)-2-(4-(4-methoxyq...)
Affinity DataIC50: >1.00E+3nM. Assay description: Inhibition of human recombinant GST-fused ALK5 expressed in Sf9 cells
In DepthDetails ArticlePubMed