BDBM50350982 CHEMBL1818329
SMILES COC[C@H](C)NCc1ccc(cc1)-c1ccccc1S(=O)(=O)N1CCCC1
InChI Key InChIKey=CPUILTROZYBBPL-KRWDZBQOSA-N
Data  2 KI
  Tab Delimited (TSV)   2D SDfile   Computed 3D by Vconf -m prep SDfile
Find this compound or compounds like it in BindingDB:
Activity Spreadsheet -- Enzyme Inhibition Constant Data from BindingDB
Found 2 hits for monomerid = 50350982
TargetKappa-type opioid receptor(Homo sapiens (Human))
Pfizer
Curated by ChEMBL
LigandPNGBDBM50350982(CHEMBL1818329)
Affinity DataKi:  8.60nM. Assay description: Displacement of [3H]diprenorphine from human kappa opioid receptor expressed in CHO cells after 1 hr by liquid scintillation counting
In DepthDetails ArticlePubMed
TargetMu-type opioid receptor(Homo sapiens (Human))
Pfizer
Curated by ChEMBL
LigandPNGBDBM50350982(CHEMBL1818329)
Affinity DataKi:  433nM. Assay description: Displacement of [3H]diprenorphine from human mu opioid receptor expressed in CHO cells after 1 hr by liquid scintillation counting
In DepthDetails ArticlePubMed