BDBM50351190 CHEMBL1818110::US8835445, 5
SMILES Cc1cc2c(N)nc(N)nc2cc1-c1ccc(N)cc1
InChI Key InChIKey=OYIKUBCUDZBNAM-UHFFFAOYSA-N
Data  4 KI
  Tab Delimited (TSV)   2D SDfile   Computed 3D by Vconf -m prep SDfile
Find this compound or compounds like it in BindingDB:
Activity Spreadsheet -- Enzyme Inhibition Constant Data from BindingDB
Found 4 hits for monomerid = 50351190
TargetDihydrofolate reductase(Staphylococcus aureus)
Trius Therapeutics
US Patent
LigandPNGBDBM50351190(CHEMBL1818110 | US8835445, 5)
Affinity DataKi:  0.890nM. Assay description: Antibacterial activity as measured by the minimal inhibitory concentrations (MIC) and minimal bactericidal concentrations of compounds are well known...
In DepthDetails US Patent
TargetDihydrofolate reductase(Staphylococcus aureus)
Trius Therapeutics
US Patent
LigandPNGBDBM50351190(CHEMBL1818110 | US8835445, 5)
Affinity DataKi:  0.890nM. Assay description: Inhibition of Staphylococcus aureus DHFR assessed as oxidation of NADPH using dihydrofolate as substrate pre-incubated for 10 mins before substrate a...
In DepthDetails ArticlePubMed
TargetDihydrofolate reductase(Homo sapiens (Human))
Trius Therapeutics, San Diego, Ca 92121, United States.
Curated by ChEMBL
LigandPNGBDBM50351190(CHEMBL1818110 | US8835445, 5)
Affinity DataKi:  138nM. Assay description: Inhibition of human DHFR assessed as oxidation of NADPH using dihydrofolate as substrate pre-incubated for 10 mins before substrate addition by spect...
In DepthDetails ArticlePubMed
TargetDihydrofolate reductase(Homo sapiens (Human))
Trius Therapeutics, San Diego, Ca 92121, United States.
Curated by ChEMBL
LigandPNGBDBM50351190(CHEMBL1818110 | US8835445, 5)
Affinity DataKi:  138nM. Assay description: Antibacterial activity as measured by the minimal inhibitory concentrations (MIC) and minimal bactericidal concentrations of compounds are well known...
In DepthDetails US Patent