BDBM50351825 CHEMBL1824445
SMILES Cc1cccc(n1)-c1nn(CC(=O)Nc2cccc(c2)C(N)=O)cc1-c1ccc2nc(C)c(C)nc2c1
InChI Key InChIKey=NIUZIUNNOKTQGY-UHFFFAOYSA-N
Data  2 IC50
  Tab Delimited (TSV)   2D SDfile   Computed 3D by Vconf -m prep SDfile
Find this compound or compounds like it in BindingDB:
Activity Spreadsheet -- Enzyme Inhibition Constant Data from BindingDB
Found 2 hits for monomerid = 50351825
TargetTGF-beta receptor type-1(Homo sapiens (Human))
Ewha Womans University
Curated by ChEMBL
LigandPNGBDBM50351825(CHEMBL1824445)
Affinity DataIC50: >1.00E+3nM. Assay description: Inhibition of human recombinant p38alpha expressed in Escherichia coli using ATF2 as substrate by radiometric kinase assay
In DepthDetails ArticlePubMed
TargetTGF-beta receptor type-1(Homo sapiens (Human))
Ewha Womans University
Curated by ChEMBL
LigandPNGBDBM50351825(CHEMBL1824445)
Affinity DataIC50: >1.00E+3nM. Assay description: Inhibition of human recombinant GST-fused ALK5 expressed in insect Sf9 cells using casein as substrate by radiometric kinase assay
In DepthDetails ArticlePubMed