BDBM50352542 CHEMBL1824886
SMILES CC(Oc1cc(cnc1N)-c1ccc(cc1)C(=O)N1C[C@H](C)N[C@H](C)C1)c1c(Cl)ccc(F)c1Cl
InChI Key InChIKey=KOOGZNWWYRPBFJ-XYPWUTKMSA-N
Data  1 KI  1 IC50
  Tab Delimited (TSV)   2D SDfile   Computed 3D by Vconf -m prep SDfile
Find this compound or compounds like it in BindingDB:
Activity Spreadsheet -- Enzyme Inhibition Constant Data from BindingDB
Found 2 hits for monomerid = 50352542
TargetHepatocyte growth factor receptor(Homo sapiens (Human))
Pfizer
Curated by ChEMBL
LigandPNGBDBM50352542(CHEMBL1824886)
Affinity DataKi:  41nM. Assay description: Binding affinity to human recombinant c-MET assessed as inhibition of autophosphorylation by continuous fluorometric assay
In DepthDetails ArticlePubMed
TargetHepatocyte growth factor receptor(Homo sapiens (Human))
Pfizer
Curated by ChEMBL
LigandPNGBDBM50352542(CHEMBL1824886)
Affinity DataIC50:  69nM. Assay description: Inhibition of human recombinant c-MET kinase expressed in A549 cells assessed as inhibition of HGF-induced autophosphorylation by ELISA method
In DepthDetails ArticlePubMed