BDBM50355190 CHEMBL1835621
SMILES Cc1cccc(n1)-c1nn(cc1-c1ccc2ncnn2c1)C(=S)Nc1ccccc1OC(F)(F)F
InChI Key InChIKey=QNEZKTZXMXWKIX-UHFFFAOYSA-N
Data  2 IC50
  Tab Delimited (TSV)   2D SDfile   Computed 3D by Vconf -m prep SDfile
Find this compound or compounds like it in BindingDB:
Activity Spreadsheet -- Enzyme Inhibition Constant Data from BindingDB
Found 2 hits for monomerid = 50355190
TargetTGF-beta receptor type-1(Homo sapiens (Human))
Ewha Womans University
Curated by ChEMBL
LigandPNGBDBM50355190(CHEMBL1835621)
Affinity DataIC50:  3.98nM. Assay description: Inhibition of human recombinant GST-fused ALK5 expressed in Sf9 cells using casein as a substrate by radioisotopic protein kinase assay
In DepthDetails ArticlePubMed
TargetTGF-beta receptor type-1(Homo sapiens (Human))
Ewha Womans University
Curated by ChEMBL
LigandPNGBDBM50355190(CHEMBL1835621)
Affinity DataIC50:  3.83E+3nM. Assay description: Inhibition of human recombinant p38alpha expressed in Escherichia coli using ATF2 as a substrate by radioisotopic protein kinase assay
In DepthDetails ArticlePubMed