BDBM50355643 CHEMBL1910886
SMILES CS(=O)(=O)NC(=O)c1sccc1SCc1ccc(Cl)c(Cl)c1
InChI Key InChIKey=WUCGCEYWGIIVMD-UHFFFAOYSA-N
Data  3 IC50
PDB links: 1 PDB ID matches this monomer.
  Tab Delimited (TSV)   2D SDfile   Computed 3D by Vconf -m prep SDfile
Find this compound or compounds like it in BindingDB:
Activity Spreadsheet -- Enzyme Inhibition Constant Data from BindingDB
Found 3 hits for monomerid = 50355643
TargetReceptor-type tyrosine-protein phosphatase gamma(Homo sapiens (Human))
Bristol-Myers Squibb Research And Development
Curated by ChEMBL
LigandPNGBDBM50355643(CHEMBL1910886)
Affinity DataIC50:  3.30E+3nM. Assay description: Inhibition of RPTPgamma expressed in Escherichia coli BL21 (DE3) assessed as reduction in dephosphorylation of Z'-Lyte phospho-Tyr 1 peptide preincub...
TargetTyrosine-protein phosphatase non-receptor type 1(Homo sapiens (Human))
Bristol-Myers Squibb Research And Development
Curated by ChEMBL
LigandPNGBDBM50355643(CHEMBL1910886)
Affinity DataIC50: >1.00E+5nM. Assay description: Inhibition of PTP1B expressed in Escherichia coli BL21 (DE3) assessed as reduction in dephosphorylation of Z'-Lyte phospho-Tyr 1 peptide preincubated...
In DepthDetails ArticlePubMed
TargetReceptor-type tyrosine-protein phosphatase C(Homo sapiens (Human))
Bristol-Myers Squibb Research And Development
Curated by ChEMBL
LigandPNGBDBM50355643(CHEMBL1910886)
Affinity DataIC50:  7.30E+4nM. Assay description: Inhibition of CD45 expressed in Escherichia coli BL21 (DE3) assessed as reduction in dephosphorylation of Z'-Lyte phospho-Tyr 1 peptide preincubated ...
In DepthDetails ArticlePubMed