BDBM50357949 CHEMBL1916929
SMILES Nc1c2CCCCc2nc2oc(c(C#N)c12)-c1ccc(Cl)cc1
InChI Key InChIKey=UOYVNQPKSGWCET-UHFFFAOYSA-N
Data  4 IC50
  Tab Delimited (TSV)   2D SDfile   Computed 3D by Vconf -m prep SDfile
Find this compound or compounds like it in BindingDB:
Activity Spreadsheet -- Enzyme Inhibition Constant Data from BindingDB
Found 4 hits for monomerid = 50357949
TargetAcetylcholinesterase(Electrophorus electricus (Electric eel))
University Of Lisbon
Curated by ChEMBL
LigandPNGBDBM50357949(CHEMBL1916929)
Affinity DataIC50: >1.00E+5nM. Assay description: Inhibition of Electrophorus electricus AChE using acetylthiocholine iodide as substrate preincubated for 10 mins before substrate addition by Ellman'...
In DepthDetails ArticlePubMed
TargetCholinesterase(Homo sapiens (Human))
University Of Lisbon
Curated by ChEMBL
LigandPNGBDBM50357949(CHEMBL1916929)
Affinity DataIC50: >1.00E+5nM. Assay description: Inhibition of human serum BuChE using butyrylthiocholine as substrate by Ellman's assay in presence of bovine serum albumin
In DepthDetails ArticlePubMed
TargetAcetylcholinesterase(Homo sapiens (Human))
University Of Lisbon
Curated by ChEMBL
LigandPNGBDBM50357949(CHEMBL1916929)
Affinity DataIC50: >1.00E+5nM. Assay description: Inhibition of human recombinant AChE using acetylthiocholine as substrate by Ellman's assay in presence of bovine serum albumin
In DepthDetails ArticlePubMed
TargetCholinesterase(Equus caballus (Horse))
University Of Lisbon
Curated by ChEMBL
LigandPNGBDBM50357949(CHEMBL1916929)
Affinity DataIC50:  3.24E+4nM. Assay description: Inhibition of equine serum BuChE using butylthiocholine iodide as substrate preincubated for 10 mins before substrate addition by Ellman's method in ...
In DepthDetails ArticlePubMed