BDBM50357950 CHEMBL1916930
SMILES Nc1c2CCCCc2nc2n(c(cc12)-c1ccc(Cl)cc1)-c1ccccc1
InChI Key InChIKey=IXVKGSLDYZAHMJ-UHFFFAOYSA-N
Data  2 IC50
  Tab Delimited (TSV)   2D SDfile   Computed 3D by Vconf -m prep SDfile
Find this compound or compounds like it in BindingDB:
Activity Spreadsheet -- Enzyme Inhibition Constant Data from BindingDB
Found 2 hits for monomerid = 50357950
TargetCholinesterase(Equus caballus (Horse))
University Of Lisbon
Curated by ChEMBL
LigandPNGBDBM50357950(CHEMBL1916930)
Affinity DataIC50:  1.50E+4nM. Assay description: Inhibition of equine serum BuChE using butylthiocholine iodide as substrate preincubated for 10 mins before substrate addition by Ellman's method in ...
In DepthDetails ArticlePubMed
TargetAcetylcholinesterase(Electrophorus electricus (Electric eel))
University Of Lisbon
Curated by ChEMBL
LigandPNGBDBM50357950(CHEMBL1916930)
Affinity DataIC50:  2.40E+4nM. Assay description: Inhibition of Electrophorus electricus AChE using acetylthiocholine iodide as substrate preincubated for 10 mins before substrate addition by Ellman'...
In DepthDetails ArticlePubMed