BDBM50361081 CHEMBL1509570
SMILES COc1ccc(cc1)S(=O)(=O)N(C)C1CCN(C)CC1
InChI Key InChIKey=LNGQSIFKSWPQHF-UHFFFAOYSA-N
Data  2 IC50
  Tab Delimited (TSV)   2D SDfile   Computed 3D by Vconf -m prep SDfile
Find this compound or compounds like it in BindingDB:
Activity Spreadsheet -- Enzyme Inhibition Constant Data from BindingDB
Found 2 hits for monomerid = 50361081
Target5-hydroxytryptamine receptor 2A(Homo sapiens (Human))
Korea Institute Of Science And Technology
Curated by ChEMBL
LigandPNGBDBM50361081(CHEMBL1509570)
Affinity DataIC50:  831nM. Assay description: Displacement of [3H]Ketanserin from human recombinant 5HT2A receptor expressed in CHOK1 cells after 60 mins
In DepthDetails ArticlePubMed
Target5-hydroxytryptamine receptor 2C(Homo sapiens (Human))
Korea Institute Of Science And Technology
Curated by ChEMBL
LigandPNGBDBM50361081(CHEMBL1509570)
Affinity DataIC50:  1.86E+3nM. Assay description: Displacement of [3H]mesulergine from human recombinant 5HT2C receptor expressed in CHOK1 cells after 60 mins
In DepthDetails ArticlePubMed