BDBM50365345 CHEMBL1956149
SMILES CC[C@@H](Cc1ccc(OC)c(CNC(=O)c2ccc3ccc4cccc5ccc2c3c45)c1)C(O)=O
InChI Key InChIKey=WXYOTFKPGLXJBW-IBGZPJMESA-N
Data  2 EC50
PDB links: 1 PDB ID matches this monomer.
  Tab Delimited (TSV)   2D SDfile   Computed 3D by Vconf -m prep SDfile
Find this compound or compounds like it in BindingDB:
Activity Spreadsheet -- Enzyme Inhibition Constant Data from BindingDB
Found 2 hits for monomerid = 50365345
TargetPeroxisome proliferator-activated receptor delta(Homo sapiens (Human))
The University Of Tokyo
Curated by ChEMBL
LigandPNGBDBM50365345(CHEMBL1956149)
Affinity DataEC50:  43nM. Assay description: Agonist activity at human PPARdelta assessed as transactivation activity
In DepthDetails ArticlePubMed
TargetPeroxisome proliferator-activated receptor alpha(Homo sapiens (Human))
The University Of Tokyo
Curated by ChEMBL
LigandPNGBDBM50365345(CHEMBL1956149)
Affinity DataEC50:  12nM. Assay description: Agonist activity at human PPARalpha assessed as transactivation activity