BDBM50366360 CHEMBL538063
SMILES CN([C@H](CN1CC[C@H](O)C1)c1cccc(N)c1)C(=O)C(c1ccccc1)c1ccccc1
InChI Key InChIKey=VSCAXFHHZFYAIN-LOSJGSFVSA-N
Data  1 KI
  Tab Delimited (TSV)   2D SDfile   Computed 3D by Vconf -m prep SDfile
Find this compound or compounds like it in BindingDB:
Activity Spreadsheet -- Enzyme Inhibition Constant Data from BindingDB
Found 1 hit for monomerid = 50366360
TargetKappa-type opioid receptor(Cavia porcellus (domestic guinea pig))
TBA
Curated by ChEMBL
LigandPNGBDBM50366360(CHEMBL538063)
Affinity DataKi:  6nM. Assay description: Affinity at K opioid receptor on membranes prepared from guinea pig cerebellum by [3H]- 69593 displacement.
In DepthDetails Article