BDBM50368216 CHEMBL2235606::CHEMBL604766
SMILES OC[C@H]1O[C@H]([C@H](O)[C@@H]1O)n1cnc2c(NC3CCc4cc(O)ccc34)ncnc12
InChI Key InChIKey=VGUMDIPNXQFLGI-DNTSPBFFSA-N
Data  2 KI
  Tab Delimited (TSV)   2D SDfile   Computed 3D by Vconf -m prep SDfile
Find this compound or compounds like it in BindingDB:
Activity Spreadsheet -- Enzyme Inhibition Constant Data from BindingDB
Found 2 hits for monomerid = 50368216
TargetAdenosine receptor A1(Rattus norvegicus (rat))
Warner-Lambert
Curated by ChEMBL
LigandPNGBDBM50368216(CHEMBL2235606 | CHEMBL604766)
Affinity DataKi:  42nM. Assay description: Binding affinity towards adenosine A1 receptor
In DepthDetails ArticlePubMed
TargetAdenosine receptor A2a/A2b(Rattus norvegicus)
Warner-Lambert
Curated by ChEMBL
LigandPNGBDBM50368216(CHEMBL2235606 | CHEMBL604766)
Affinity DataKi:  769nM. Assay description: Binding affinity towards adenosine A2 receptor
In DepthDetails ArticlePubMed