BDBM50374312 CHEMBL270834
SMILES [#7]\[#6](-[#7])=[#7]\[#6]-[#6]-[#6]-[#6@@H](-[#7]S(=O)(=O)[#6]-[#6]-c1ccccc1)-[#6](=O)-[#7]-[#6]-[#6](=O)-[#7]-[#6@@H](-[#6]-[#6]-[#6]\[#7]=[#6](\[#7])-[#7])-[#6](=O)-c1nc2ccccc2o1
InChI Key InChIKey=WOLHGVQMGPTOEN-FCHUYYIVSA-N
Data  4 IC50
  Tab Delimited (TSV)   2D SDfile   Computed 3D by Vconf -m prep SDfile
Find this compound or compounds like it in BindingDB:
Activity Spreadsheet -- Enzyme Inhibition Constant Data from BindingDB
Found 4 hits for monomerid = 50374312
TargetCoagulation factor X(Homo sapiens (Human))
Johnson & Johnson Pharmaceutical Research & Development
Curated by ChEMBL
LigandPNGBDBM50374312(CHEMBL270834)
Affinity DataIC50:  2nM. Assay description: Inhibition of human factor 10a
In DepthDetails ArticlePubMed
TargetTissue-type plasminogen activator(Homo sapiens (Human))
Johnson & Johnson Pharmaceutical Research & Development
Curated by ChEMBL
LigandPNGBDBM50374312(CHEMBL270834)
Affinity DataIC50:  29nM. Assay description: Inhibition of tPA
In DepthDetails ArticlePubMed
TargetPlasma kallikrein(Homo sapiens (Human))
Johnson & Johnson Pharmaceutical Research & Development
Curated by ChEMBL
LigandPNGBDBM50374312(CHEMBL270834)
Affinity DataIC50:  13nM. Assay description: Inhibition of kallikrein
In DepthDetails ArticlePubMed
TargetPlasminogen(Homo sapiens (Human))
Johnson & Johnson Pharmaceutical Research & Development
Curated by ChEMBL
LigandPNGBDBM50374312(CHEMBL270834)
Affinity DataIC50:  36nM. Assay description: Inhibition of plasmin
In DepthDetails ArticlePubMed