BDBM50381013 CHEMBL2017129
SMILES Oc1c(cc(cc1[N+]([O-])=O)-c1cc(F)cc(c1O)[N+]([O-])=O)C(=O)C1CCc2ccccc12
InChI Key InChIKey=BQHKHXCLONFLRD-UHFFFAOYSA-N
Data  1 KI  6 IC50
  Tab Delimited (TSV)   2D SDfile   Computed 3D by Vconf -m prep SDfile
Find this compound or compounds like it in BindingDB:
Activity Spreadsheet -- Enzyme Inhibition Constant Data from BindingDB
Found 7 hits for monomerid = 50381013
TargetPeptidyl-prolyl cis-trans isomerase NIMA-interacting 1(Homo sapiens (Human))
Chinese Academy Of Medical Sciences & Peking Union Medical College
Curated by ChEMBL
LigandPNGBDBM50381013(CHEMBL2017129)
Affinity DataKi:  200nM. Assay description: Inhibition of human Pin1
In DepthDetails ArticlePubMed
TargetPeptidyl-prolyl cis-trans isomerase A(Homo sapiens (Human))TBA
LigandPNGBDBM50381013(CHEMBL2017129)
Affinity DataIC50:  520nM. Assay description: Inhibition of CypA (unknown origin)
In DepthDetails PubMed
TargetPeptidyl-prolyl cis-trans isomerase NIMA-interacting 1(Homo sapiens (Human))
Chinese Academy Of Medical Sciences & Peking Union Medical College
Curated by ChEMBL
LigandPNGBDBM50381013(CHEMBL2017129)
Affinity DataIC50:  200nM. Assay description: Inhibition of Pin1 (unknown origin)
In DepthDetails PubMed
TargetPeptidyl-prolyl cis-trans isomerase C(Homo sapiens (Human))TBA
LigandPNGBDBM50381013(CHEMBL2017129)
Affinity DataIC50: >1.00E+5nM. Assay description: Inhibition of CypC (unknown origin)
In DepthDetails PubMed
TargetPeptidyl-prolyl cis-trans isomerase D(Homo sapiens (Human))TBA
LigandPNGBDBM50381013(CHEMBL2017129)
Affinity DataIC50:  2.42E+3nM. Assay description: Inhibition of CypD (unknown origin)
In DepthDetails PubMed
TargetPeptidyl-prolyl cis-trans isomerase-like 1(Homo sapiens (Human))TBA
LigandPNGBDBM50381013(CHEMBL2017129)
Affinity DataIC50:  2.90E+4nM. Assay description: Inhibition of PPIL1 (unknown origin)
In DepthDetails PubMed
TargetPeptidyl-prolyl cis-trans isomerase B(Homo sapiens (Human))TBA
LigandPNGBDBM50381013(CHEMBL2017129)
Affinity DataIC50: >1.00E+5nM. Assay description: Inhibition of CypB (unknown origin)
In DepthDetails PubMed