BDBM50382987 CHEMBL2030688
SMILES CCc1cc2c(cc1OCC(=O)OC(C)C)occ(-c1nc(C)cs1)c2=O
InChI Key InChIKey=YONWQHLMHQQTEV-UHFFFAOYSA-N
Data  1 KI
  Tab Delimited (TSV)   2D SDfile   Computed 3D by Vconf -m prep SDfile
Find this compound or compounds like it in BindingDB:
Activity Spreadsheet -- Enzyme Inhibition Constant Data from BindingDB
Found 1 hit for monomerid = 50382987
TargetAdenosine receptor A2a(Homo sapiens (Human))
Heptares Therapeutics
Curated by ChEMBL
LigandPNGBDBM50382987(CHEMBL2030688)
Affinity DataKi:  15.1nM. Assay description: Displacement of [3H]ZM241385 from human A2A receptor expressed in HEK293 cells after 1 hr by liquid scintillation counting
In DepthDetails ArticlePubMed