BDBM50384115 CHEMBL2029688
SMILES O=C1N(CCc2nnn(Cc3ccc4ncccc4c3)c12)c1ccccc1
InChI Key InChIKey=ZSFSLLGRLMODAE-UHFFFAOYSA-N
Data  1 IC50
PDB links: 1 PDB ID matches this monomer.
  Tab Delimited (TSV)   2D SDfile   Computed 3D by Vconf -m prep SDfile
Find this compound or compounds like it in BindingDB:
Activity Spreadsheet -- Enzyme Inhibition Constant Data from BindingDB
Found 1 hit for monomerid = 50384115
TargetHepatocyte growth factor receptor(Homo sapiens (Human))
Amgen
Curated by ChEMBL
LigandPNGBDBM50384115(CHEMBL2029688)
Affinity DataIC50:  612nM. Assay description: Inhibition of c-Met