BDBM50387545 CHEMBL2059907
SMILES CC(=O)Nc1nc2ccc(cn2n1)-c1cncc(c1)S(C)(=O)=O
InChI Key InChIKey=RCRCKEODQLBHAY-UHFFFAOYSA-N
Data  8 IC50
PDB links: 1 PDB ID matches this monomer.
  Tab Delimited (TSV)   2D SDfile   Computed 3D by Vconf -m prep SDfile
Find this compound or compounds like it in BindingDB:
Activity Spreadsheet -- Enzyme Inhibition Constant Data from BindingDB
Found 8 hits for monomerid = 50387545
LigandPNGBDBM50387545(CHEMBL2059907)
Affinity DataIC50:  79.4nM. Assay description: Inhibition of PI3Kgamma by high throughput chemoproteomics binding assay
LigandPNGBDBM50387545(CHEMBL2059907)
Affinity DataIC50:  5.01E+3nM. Assay description: Inhibition of PI3Kdelta by high throughput chemoproteomics binding assay
In DepthDetails ArticlePubMed
LigandPNGBDBM50387545(CHEMBL2059907)
Affinity DataIC50: >6.31E+4nM. Assay description: Inhibition of PI3Kgamma assessed as inhibition of C5a-induced AKT phosphorylation at Ser473 by cell based assay
LigandPNGBDBM50387545(CHEMBL2059907)
Affinity DataIC50:  79.4nM. Assay description: Inhibition of PI3Kgamma in human HL60 cell lysate by kinobead assay
LigandPNGBDBM50387545(CHEMBL2059907)
Affinity DataIC50:  2.00E+3nM. Assay description: Inhibition of PI3Kgamma assessed as inhibition of fMLP-induced neutrophil migration assay by cell based assay
LigandPNGBDBM50387545(CHEMBL2059907)
Affinity DataIC50:  5.01E+3nM. Assay description: Inhibition of PI3Kdelta in human HL60 cell lysate by kinobead assay
In DepthDetails ArticlePubMed
LigandPNGBDBM50387545(CHEMBL2059907)
Affinity DataIC50:  3.98E+3nM. Assay description: Inhibition of PI3Kalpha in human HL60 cell lysate by kinobead assay
In DepthDetails ArticlePubMed
LigandPNGBDBM50387545(CHEMBL2059907)
Affinity DataIC50:  3.98E+3nM. Assay description: Inhibition of PI3Kalpha by high throughput chemoproteomics binding assay
In DepthDetails ArticlePubMed